मैं स्पंदन और एंड्रॉइड स्टूडियो के लिए कुल शुरुआत कर रहा हूं और जैसा कि मैं एक बहुत ही बुनियादी हैलो वर्ल्ड प्रोग्राम चलाने की कोशिश कर रहा था, मुझे यह मिला:

FAILURE: Build failed with an exception.

* What went wrong:
Execution failed for task ':app:packageDebug'.
> A failure occurred while executing com.android.build.gradle.internal.tasks.Workers$ActionFacade
   > java.io.FileNotFoundException: D:\flutter\newapp\build\app\intermediates\signing_config\debug\out\signing-config.json (Access is denied)

* Try:
Run with --stacktrace option to get the stack trace. Run with --info or --debug option to get more log output. Run with --scan to get full insights.

* Get more help at https://help.gradle.org

BUILD FAILED in 16s
[!] Gradle threw an error while downloading artifacts from the network. Retrying to download...
Running Gradle task 'assembleDebug'...

FAILURE: Build failed with an exception.

* What went wrong:
Execution failed for task ':app:packageDebug'.
> A failure occurred while executing com.android.build.gradle.internal.tasks.Workers$ActionFacade
   > java.io.FileNotFoundException: D:\flutter\newapp\build\app\intermediates\signing_config\debug\out\signing-config.json (Access is denied)

* Try:
Run with --stacktrace option to get the stack trace. Run with --info or --debug option to get more log output. Run with --scan to get full insights.

* Get more help at https://help.gradle.org

BUILD FAILED in 2s
[!] Gradle threw an error while downloading artifacts from the network. Retrying to download...
Exception: Gradle task assembleDebug failed with exit code 1

मैंने flutter clean की कोशिश की है, लेकिन वह काम नहीं किया। मैंने एंड्रॉइड स्टूडियो के माध्यम से कैश को मैन्युअल रूप से साफ़ किया जो या तो काम नहीं करता था। मैंने अंत में अपनी मशीन को रिबूट किया और वह भी काम नहीं किया।

मैं भाग्य और समाधान से बाहर हूं। किसी भी सहायता की सराहना की जाएगी।

(विंडोज़ 10 चल रहा है)

1
graywartz doomski 8 जुलाई 2020, 09:58
 – 
Wei Jun
8 जुलाई 2020, 10:15

3 जवाब

सबसे बढ़िया उत्तर

मार्ग D:\flutter\newapp\build\app\intermediates\signing_config\debug\out\ पर जाएं और signing-config.json फ़ाइल को हटा दें और फिर से चलाएँ।

5
EdwardLi 12 जुलाई 2020, 04:04

मैं स्पंदन एसडीके को फिर से डाउनलोड करने की सलाह दूंगा, और एंड्रॉइड स्टूडियो के बजाय माइक्रोसॉफ्ट वीएससी का उपयोग करूंगा। इसका हल्का और निष्क्रिय आपके पीसी पर बहुत अधिक तनाव पैदा करता है।

0
Blank 8 जुलाई 2020, 10:12
दुर्भाग्य से, मैं ऐसा नहीं कर सकता क्योंकि मैंने स्पंदन पर एक उदमी पाठ्यक्रम खरीदा है और प्रोफेसर एंड्रॉइड स्टूडियो का उपयोग कर रहे हैं इसलिए मैं उसके साथ तालमेल बिठाना चाहता हूं।
 – 
graywartz doomski
8 जुलाई 2020, 10:17
अच्छा... हालांकि आप स्पंदन एसडीके के किस संस्करण का उपयोग कर रहे हैं ?? क्या आपने एक स्थिर संस्करण डाउनलोड किया?
 – 
Blank
8 जुलाई 2020, 10:31
हाँ यह एक स्थिर संस्करण है। स्पंदन 1.17.5।
 – 
graywartz doomski
8 जुलाई 2020, 11:19

मेरे पास एक ही त्रुटि थी, आदेश स्पंदन साफ ​​काम किया।

0
Carlos 24 सितंबर 2020, 15:22