जब मैंने इस प्रोजेक्ट को बनाने की कोशिश की, तो मुझे यह त्रुटि मेरे कंसोल में प्रिंट हो गई।

लेकिन, जब मैं अन्य परियोजनाओं के निर्माण की कोशिश करता हूं, कोई त्रुटि नहीं होती है। ऐसा क्यों है?

2 दिन पहले सब कुछ ठीक चल रहा था।

यहाँ त्रुटि है,

unning "flutter pub get" in SampleApp...
Launching lib\main.dart on Android SDK built for x86 in debug mode...
/E:/flutter/.pub-cache/hosted/pub.dartlang.org/firebase-7.3.0/lib/src/top_level.dart:1:8: Error: Not found: 'dart:html'
import 'dart:html';
       ^
/E:/flutter/.pub-cache/hosted/pub.dartlang.org/js-0.6.2/lib/js.dart:8:1: Error: Not found: 'dart:js'
export 'dart:js' show allowInterop, allowInteropCaptureThis;
^
/E:/flutter/.pub-cache/hosted/pub.dartlang.org/js-0.6.2/lib/js_util.dart:8:1: Error: Not found: 'dart:js_util'
export 'dart:js_util';
^
/E:/flutter/.pub-cache/hosted/pub.dartlang.org/flutter_svg-0.17.4/lib/src/picture_stream.dart:88:26: Error: Type 'DiagnosticableMixin' not found.
class PictureStream with DiagnosticableMixin {
                         ^^^^^^^^^^^^^^^^^^^
/E:/flutter/.pub-cache/hosted/pub.dartlang.org/flutter_svg-0.17.4/lib/src/picture_stream.dart:192:44: Error: Type 'DiagnosticableMixin' not found.
abstract class PictureStreamCompleter with DiagnosticableMixin {
                                           ^^^^^^^^^^^^^^^^^^^

FAILURE: Build failed with an exception.

* Where:
Script 'E:\flutter\packages\flutter_tools\gradle\flutter.gradle' line: 896

* What went wrong:
Execution failed for task ':app:compileFlutterBuildDebug'.
> Process 'command 'E:\flutter\bin\flutter.bat'' finished with non-zero exit value 1

* Try:
Run with --stacktrace option to get the stack trace. Run with --info or --debug option to get more log output. Run with --scan to get full insights.

* Get more help at https://help.gradle.org

BUILD FAILED in 4m 13s
Exception: Gradle task assembleDebug failed with exit code 1
Exited (sigterm)

मैंने flutter clean चलाने की कोशिश की, लेकिन इससे कोई फायदा नहीं हुआ।

0
Madhavam Pratap Shahi 9 अगस्त 2020, 13:20

1 उत्तर

सबसे बढ़िया उत्तर

यह 'फायरबेस' पैकेज की वजह से हुआ।

मुझे लगता है कि इसमें कुछ त्रुटियां हैं।

1
Madhavam Shahi 9 अगस्त 2020, 13:43