Running Gradle task 'assembleDebug'...
java.nio.file.NoSuchFileException: C:\Users\nobit\AndroidStudioProjects\Production\secret_keeper\build\app\intermediates\external_file_lib_dex_archives\debug\out
        at sun.nio.fs.WindowsException.translateToIOException(WindowsException.java:79)
        at sun.nio.fs.WindowsException.rethrowAsIOException(WindowsException.java:97)
        at sun.nio.fs.WindowsException.rethrowAsIOException(WindowsException.java:102)
        at sun.nio.fs.WindowsDirectoryStream.<init>(WindowsDirectoryStream.java:80)
        at sun.nio.fs.WindowsFileSystemProvider.newDirectoryStream(WindowsFileSystemProvider.java:522)
        at java.nio.file.Files.newDirectoryStream(Files.java:457)
        at java.nio.file.Files.list(Files.java:3451)
        at com.android.build.gradle.internal.tasks.DexMergingParams.getAllDexFiles(DexMergingTask.kt:502)
        at com.android.build.gradle.internal.tasks.DexMergingTaskRunnable.run(DexMergingTask.kt:423)
        at com.android.build.gradle.internal.tasks.Workers$ActionFacade.run(Workers.kt:335)
        at org.gradle.workers.internal.AdapterWorkAction.execute(AdapterWorkAction.java:50)
        at org.gradle.workers.internal.DefaultWorkerServer.execute(DefaultWorkerServer.java:47)
        at org.gradle.workers.internal.NoIsolationWorkerFactory$1$1$1.create(NoIsolationWorkerFactory.java:65)
        at org.gradle.workers.internal.NoIsolationWorkerFactory$1$1$1.create(NoIsolationWorkerFactory.java:61)
        at org.gradle.internal.classloader.ClassLoaderUtils.executeInClassloader(ClassLoaderUtils.java:98)
        at org.gradle.workers.internal.NoIsolationWorkerFactory$1$1.execute(NoIsolationWorkerFactory.java:61)
        at org.gradle.workers.internal.AbstractWorker$1.call(AbstractWorker.java:44)
        at org.gradle.workers.internal.AbstractWorker$1.call(AbstractWorker.java:41)
        at org.gradle.internal.operations.DefaultBuildOperationExecutor$CallableBuildOperationWorker.execute(DefaultBuildOperationExecutor.java:416)
        at org.gradle.internal.operations.DefaultBuildOperationExecutor$CallableBuildOperationWorker.execute(DefaultBuildOperationExecutor.java:406)
        at org.gradle.internal.operations.DefaultBuildOperationExecutor$1.execute(DefaultBuildOperationExecutor.java:165)
        at org.gradle.internal.operations.DefaultBuildOperationExecutor.execute(DefaultBuildOperationExecutor.java:250)
        at org.gradle.internal.operations.DefaultBuildOperationExecutor.execute(DefaultBuildOperationExecutor.java:158)
        at org.gradle.internal.operations.DefaultBuildOperationExecutor.call(DefaultBuildOperationExecutor.java:102)
        at org.gradle.internal.operations.DelegatingBuildOperationExecutor.call(DelegatingBuildOperationExecutor.java:36)
        at org.gradle.workers.internal.AbstractWorker.executeWrappedInBuildOperation(AbstractWorker.java:41)
        at org.gradle.workers.internal.NoIsolationWorkerFactory$1.execute(NoIsolationWorkerFactory.java:56)
        at org.gradle.workers.internal.DefaultWorkerExecutor$3.call(DefaultWorkerExecutor.java:215)
        at org.gradle.workers.internal.DefaultWorkerExecutor$3.call(DefaultWorkerExecutor.java:210)
        at java.util.concurrent.FutureTask.run(FutureTask.java:266)
        at org.gradle.internal.work.DefaultConditionalExecutionQueue$ExecutionRunner.runExecution(DefaultConditionalExecutionQueue.java:215)
        at org.gradle.internal.work.DefaultConditionalExecutionQueue$ExecutionRunner.runBatch(DefaultConditionalExecutionQueue.java:164)
        at org.gradle.internal.work.DefaultConditionalExecutionQueue$ExecutionRunner.run(DefaultConditionalExecutionQueue.java:131)
        at java.util.concurrent.Executors$RunnableAdapter.call(Executors.java:511)
        at java.util.concurrent.FutureTask.run(FutureTask.java:266)
        at org.gradle.internal.concurrent.ExecutorPolicy$CatchAndRecordFailures.onExecute(ExecutorPolicy.java:64)
        at org.gradle.internal.concurrent.ManagedExecutorImpl$1.run(ManagedExecutorImpl.java:48)
        at java.util.concurrent.ThreadPoolExecutor.runWorker(ThreadPoolExecutor.java:1149)
        at java.util.concurrent.ThreadPoolExecutor$Worker.run(ThreadPoolExecutor.java:624)
        at org.gradle.internal.concurrent.ThreadFactoryImpl$ManagedThreadRunnable.run(ThreadFactoryImpl.java:56)
        at java.lang.Thread.run(Thread.java:748)


FAILURE: Build failed with an exception.

* What went wrong:
Execution failed for task ':app:mergeDexDebug'.
> A failure occurred while executing com.android.build.gradle.internal.tasks.Workers$ActionFacade
   > java.nio.file.NoSuchFileException: C:\Users\nobit\AndroidStudioProjects\Production\secret_keeper\build\app\intermediates\external_file_lib_dex_archives\debug\out

* Try:
Run with --stacktrace option to get the stack trace. Run with --info or --debug option to get more log output. Run with --scan to get full insights.

* Get more help at https://help.gradle.org

BUILD FAILED in 2m 36s
Running Gradle task 'assembleDebug'...
Running Gradle task 'assembleDebug'... Done                       163.3s (!)
Exception: Gradle task assembleDebug failed with exit code 1

स्पंदन साफ ​​चलाने के बाद यह अपवाद मिला, साफ करने से पहले यह काम कर रहा है लेकिन साफ ​​करने के बाद यह अपवाद दिखा रहा है।

स्पंदन चिकित्सक -v

[√] स्पंदन (चैनल स्थिर, 1.22.5, माइक्रोसॉफ्ट विंडोज पर [संस्करण 10.0.19041.685], लोकेल एन-इन) • C:\FlutterSDK\flutter पर स्पंदन संस्करण 1.22.5 • फ्रेमवर्क संशोधन 7891006299 (4 सप्ताह पहले), 2020-12-10 11:54:40 -0800 • इंजन संशोधन ae90085a84 • डार्ट संस्करण 2.10.4

[√] एंड्रॉइड टूलचेन - एंड्रॉइड डिवाइसों के लिए विकसित (एंड्रॉइड एसडीके संस्करण 30.0.2) • एंड्रॉइड एसडीके सी: \ उपयोगकर्ता \ नोबिट \ ऐपडाटा \ लोकल \ एंड्रॉइड \ एसडीके पर • प्लेटफॉर्म एंड्रॉइड -30, बिल्ड-टूल्स 30.0.2 • जावा बाइनरी पर: C:\Program Files\Android\Android Studio\jre\bin\java • Java संस्करण OpenJDK रनटाइम एनवायरनमेंट (बिल्ड 1.8.0_242-रिलीज़-1644-b01) • सभी Android लाइसेंस स्वीकार किए जाते हैं।

[!] Android Studio (संस्करण 4.1.0) • C:\Program Files\Android\Android Studio X Flutter प्लगइन पर Android Studio स्थापित नहीं है; यह स्पंदन विशिष्ट कार्यक्षमता जोड़ता है। एक्स डार्ट प्लगइन स्थापित नहीं है; यह डार्ट विशिष्ट कार्यक्षमता जोड़ता है। • जावा संस्करण ओपनजेडीके रनटाइम एनवायरनमेंट (बिल्ड 1.8.0_242-रिलीज़-1644-बी01)

[√] VS कोड (संस्करण 1.51.1) • VS कोड C:\Users\nobit\AppData\Local\Programs\Microsoft VS कोड • स्पंदन एक्सटेंशन संस्करण 3.16.0

[√] कनेक्टेड डिवाइस (1 उपलब्ध) • विवो Y21L (मोबाइल) • c98e68ea • android-arm • Android 5.1.1 (API 22)

! डॉक्टर को 1 श्रेणी में समस्याएँ मिलीं।

3
Jaydip Pawar 9 जिंदा 2021, 16:28
BTW, Anda harus menunggu sekitar 1 detik antara setiap operasi pembacaan dari CPU PerformanceCounter (untuk memastikan pembaruan).
 – 
Shubham Narkhede
9 जिंदा 2021, 18:00

1 उत्तर

सबसे बढ़िया उत्तर

समस्या मल्टीडेक्स बिल्डर के साथ है।

Android/app/build.gradle पर जाएँ और कोड की निम्नलिखित पंक्तियाँ जोड़ें:

dependencies {
  implementation "androidx.multidex:multidex:2.0.1"
}
android {
    defaultConfig {
        multiDexEnabled true
    }
}
4
Shubham Narkhede 9 जिंदा 2021, 16:44